make sure to build the old bindings for now

9 jobs from master in 27 minutes and 31 seconds (queued for 2 seconds)
Status Job ID Name Coverage
  Test
failed #2219
linux64 docker
linux64_docker_ci

00:00:38

failed #2220
linux64 docker
linux64_docker_cxx98_compat_ci

00:00:32

failed #2221
linux64 docker
linux64_docker_minimal_ci

00:00:20

failed #2223
linux64 official
linux64_official_snapshot

00:01:38

failed #2226
macos64 official
macos64_official_snapshot

00:01:54

passed #2227
linux64 official
source_official_snapshot

00:00:13

failed #2225
windows32 official allowed to fail
windows32_official_snapshot

00:03:54

failed #2222
windows64 official
windows64_msvc_ci

00:17:35

failed #2224
windows64 official
windows64_official_snapshot

00:04:06

 
Name Stage Failure
failed
windows64_official_snapshot Test There is an unknown failure, please try again
/cygdrive/c/Gitlab-Runner/builds/f584265b/0/gmsh/gmsh/Common/gmsh.cpp:325:61:   required from here
/cygdrive/c/Gitlab-Runner/builds/f584265b/0/gmsh/gmsh/Common/gmsh.cpp:295:31: warning: comparison between signed and unsigned integer expressions [-Wsign-compare]
/cygdrive/c/Gitlab-Runner/builds/f584265b/0/gmsh/gmsh/Common/gmsh.cpp: In instantiation of 'void addElementInfo(std::vector<T*>&, std::vector<int>&, std::vector<std::vector<int> >&, std::vector<std::vector<int> >&) [with T = MPyramid]':
/cygdrive/c/Gitlab-Runner/builds/f584265b/0/gmsh/gmsh/Common/gmsh.cpp:326:63: required from here
/cygdrive/c/Gitlab-Runner/builds/f584265b/0/gmsh/gmsh/Common/gmsh.cpp:295:31: warning: comparison between signed and unsigned integer expressions [-Wsign-compare]
make[2]: *** [CMakeFiles/gmsh.dir/build.make:591: CMakeFiles/gmsh.dir/Common/gmsh.cpp.o] Error 1
make[1]: *** [CMakeFiles/Makefile2:548: CMakeFiles/gmsh.dir/all] Error 2
make: *** [Makefile:161: all] Error 2
ERROR: Job failed: exit status 2
failed
windows64_msvc_ci Test There is an unknown failure, please try again
  ..\Common\gmsh.cpp(657): error C2084: function 'int gmshModelGeoSynchronize(void)' already has a body [C:\Gitlab-Runner\builds\f584265b\0\gmsh\gmsh\build\gmsh.vcxproj]
..\Common\gmsh.cpp(659): error C2039: 'getOccInternals' : is not a member of 'GModel' [C:\Gitlab-Runner\builds\f584265b\0\gmsh\gmsh\build\gmsh.vcxproj]
..\Common\gmsh.cpp(659): error C2227: left of '->synchronize' must point to class/struct/union/generic type [C:\Gitlab-Runner\builds\f584265b\0\gmsh\gmsh\build\gmsh.vcxproj]

8 Warning(s)
3 Error(s)

Time Elapsed 00:17:07.97
ERROR: Job failed: exit status 1
failed
windows32_official_snapshot Test There is an unknown failure, please try again
/cygdrive/c/Gitlab-Runner/builds/5baf0e9c/0/gmsh/gmsh/Common/gmsh.cpp:325:61:   required from here
/cygdrive/c/Gitlab-Runner/builds/5baf0e9c/0/gmsh/gmsh/Common/gmsh.cpp:295:31: warning: comparison between signed and unsigned integer expressions [-Wsign-compare]
/cygdrive/c/Gitlab-Runner/builds/5baf0e9c/0/gmsh/gmsh/Common/gmsh.cpp: In instantiation of 'void addElementInfo(std::vector<T*>&, std::vector<int>&, std::vector<std::vector<int> >&, std::vector<std::vector<int> >&) [with T = MPyramid]':
/cygdrive/c/Gitlab-Runner/builds/5baf0e9c/0/gmsh/gmsh/Common/gmsh.cpp:326:63: required from here
/cygdrive/c/Gitlab-Runner/builds/5baf0e9c/0/gmsh/gmsh/Common/gmsh.cpp:295:31: warning: comparison between signed and unsigned integer expressions [-Wsign-compare]
make[2]: *** [CMakeFiles/gmsh.dir/build.make:591: CMakeFiles/gmsh.dir/Common/gmsh.cpp.o] Error 1
make[1]: *** [CMakeFiles/Makefile2:804: CMakeFiles/gmsh.dir/all] Error 2
make: *** [Makefile:161: all] Error 2
ERROR: Job failed: exit status 2
failed
macos64_official_snapshot Test There is an unknown failure, please try again
                     getOCCInternals
/Users/geuzaine/builds/cf213a2a/0/gmsh/gmsh/Geo/GModel.h:211:18: note: 'getOCCInternals' declared here
OCC_Internals *getOCCInternals(){ return _occ_internals; }
^
2 errors generated.
make[2]: *** [CMakeFiles/gmsh.dir/Common/gmsh.cpp.o] Error 1
make[1]: *** [CMakeFiles/gmsh.dir/all] Error 2
make: *** [all] Error 2
ERROR: Job failed: exit status 1
failed
linux64_official_snapshot Test There is an unknown failure, please try again
/home/gitlab-runner/builds/8bb93ac1/0/gmsh/gmsh/Common/gmsh.cpp:325:61:   required from here
/home/gitlab-runner/builds/8bb93ac1/0/gmsh/gmsh/Common/gmsh.cpp:295:26: warning: comparison between signed and unsigned integer expressions [-Wsign-compare]
/home/gitlab-runner/builds/8bb93ac1/0/gmsh/gmsh/Common/gmsh.cpp: In instantiation of ‘void addElementInfo(std::vector<T*>&, std::vector<int>&, std::vector<std::vector<int> >&, std::vector<std::vector<int> >&) [with T = MPyramid]’:
/home/gitlab-runner/builds/8bb93ac1/0/gmsh/gmsh/Common/gmsh.cpp:326:63: required from here
/home/gitlab-runner/builds/8bb93ac1/0/gmsh/gmsh/Common/gmsh.cpp:295:26: warning: comparison between signed and unsigned integer expressions [-Wsign-compare]
make[2]: *** [CMakeFiles/gmsh.dir/Common/gmsh.cpp.o] Error 1
make[1]: *** [CMakeFiles/gmsh.dir/all] Error 2
make: *** [all] Error 2
ERROR: Job failed: exit status 1
failed
linux64_docker_minimal_ci Test There is an unknown failure, please try again
/builds/gmsh/gmsh/Common/gmsh.cpp:295:31: warning: comparison between signed and unsigned integer expressions [-Wsign-compare]
CMakeFiles/gmsh.dir/build.make:590: recipe for target 'CMakeFiles/gmsh.dir/Common/gmsh.cpp.o' failed
make[2]: *** [CMakeFiles/gmsh.dir/Common/gmsh.cpp.o] Error 1
make[2]: *** Waiting for unfinished jobs....
make[1]: *** [CMakeFiles/gmsh.dir/all] Error 2
CMakeFiles/Makefile2:419: recipe for target 'CMakeFiles/gmsh.dir/all' failed
Makefile:160: recipe for target 'all' failed
make: *** [all] Error 2
ERROR: Job failed: exit code 1
failed
linux64_docker_cxx98_compat_ci Test There is an unknown failure, please try again
[  2%] Building CXX object CMakeFiles/gmsh.dir/Numeric/Numeric.cpp.o
CMakeFiles/gmsh.dir/build.make:590: recipe for target 'CMakeFiles/gmsh.dir/Common/gmsh.cpp.o' failed
make[2]: *** [CMakeFiles/gmsh.dir/Common/gmsh.cpp.o] Error 1
make[2]: *** Waiting for unfinished jobs....
CMakeFiles/Makefile2:419: recipe for target 'CMakeFiles/gmsh.dir/all' failed
make[1]: *** [CMakeFiles/gmsh.dir/all] Error 2
make: *** [all] Error 2
Makefile:160: recipe for target 'all' failed
ERROR: Job failed: exit code 1
failed
linux64_docker_ci Test There is an unknown failure, please try again
/builds/gmsh/gmsh/Common/gmsh.cpp:295:31: warning: comparison between signed and unsigned integer expressions [-Wsign-compare]
CMakeFiles/gmsh.dir/build.make:590: recipe for target 'CMakeFiles/gmsh.dir/Common/gmsh.cpp.o' failed
make[2]: *** [CMakeFiles/gmsh.dir/Common/gmsh.cpp.o] Error 1
make[2]: *** Waiting for unfinished jobs....
CMakeFiles/Makefile2:419: recipe for target 'CMakeFiles/gmsh.dir/all' failed
make[1]: *** [CMakeFiles/gmsh.dir/all] Error 2
make: *** [all] Error 2
Makefile:160: recipe for target 'all' failed
ERROR: Job failed: exit code 1