Merge branch 'master' into eigenValueTarget

2 jobs for eigenValueTarget in 5 minutes and 39 seconds (queued for 5 seconds)
Status Name Job ID Coverage
  Build
passed linux64_build #60348
linux64 docker

00:01:48

 
  Test
failed linux64_coverage #60349
linux64 docker

00:03:51

 
Name Stage Failure
failed
linux64_coverage Test There is an unknown failure, please try again
[runner-02a425dd-project-133-concurrent-0:01085] [ 6] /lib/x86_64-linux-gnu/libstdc++.so.6(__cxa_rethrow+0x4d)[0x7f2b87de46fd]
[runner-02a425dd-project-133-concurrent-0:01085] [ 7] ./coverage(+0x538e8)[0x556fa63a98e8]
[runner-02a425dd-project-133-concurrent-0:01085] [ 8] ./coverage(main+0x10d)[0x556fa63ad00d]
[runner-02a425dd-project-133-concurrent-0:01085] [ 9] /lib/x86_64-linux-gnu/libc.so.6(__libc_start_main+0xf3)[0x7f2b879e00b3]
[runner-02a425dd-project-133-concurrent-0:01085] [10] ./coverage(_start+0x2e)[0x556fa63ad35e]
[runner-02a425dd-project-133-concurrent-0:01085] *** End of error message ***
make[3]: *** [CMakeFiles/coverage_report.dir/build.make:58: CMakeFiles/coverage_report] Aborted (core dumped)
make[2]: *** [CMakeFiles/Makefile2:568: CMakeFiles/coverage_report.dir/all] Error 2
make[1]: *** [CMakeFiles/Makefile2:575: CMakeFiles/coverage_report.dir/rule] Error 2
make: *** [Makefile:175: coverage_report] Error 2