Remove unused code

2 jobs for UpdateGmshAPIFunctions in 1 minute and 37 seconds (queued for 2 seconds)
Status Name Job ID Coverage
  Build
failed linux64_build #57315
linux64 docker

00:01:37

 
  Test
skipped linux64_coverage #57316
linux64 docker
 
Name Stage Failure
failed
linux64_build Build There is an unknown failure, please try again
  168 |           gmsh::model::mesh::getNode(nodeTags[i], coord, parametricCoord, dim, tag);
| ~~~~~~~~~~~~~~~~~~~~~~~~~~^~~~~~~~~~~~~~~~~~~~~~~~~~~~~~~~~~~~~~~~~~~~~~~
In file included from /builds/gmsh/fem/src/field/FunctionSpaceConstant.cpp:12:
/usr/local/include/gmsh.h:704:21: note: declared here
704 | GMSH_API void getNode(const std::size_t nodeTag,
| ^~~~~~~
make[2]: *** [CMakeFiles/shared.dir/build.make:700: CMakeFiles/shared.dir/src/field/FunctionSpaceConstant.cpp.o] Error 1
make[2]: *** Waiting for unfinished jobs....
make[1]: *** [CMakeFiles/Makefile2:1225: CMakeFiles/shared.dir/all] Error 2
make: *** [Makefile:141: all] Error 2